Vegetation property
type: Concept
narrower: Normalized difference vegetation index

Normalized difference vegetation index
definition: [Wikipedia] The normalized difference vegetation index (NDVI) is a simple graphical indicator that can be used to analyze remote sensing measurements, often from a space platform, assessing whether or not the target being observed contains live green vegetation.
type: Property
type: Concept
broader: Vegetation property
in scheme: ozcar-theia
alternative label: NDVI
modified: 2022-03-10T14:00:07
created: 2022-02-07T17:00:00