Temporal maximum
type: StatisticalMeasure
type: Concept
broader: Maximum

Statistical method
type: Concept
narrower: Maximum

Maximum
broader: Statistical method
definition: [Wikipedia] In mathematical analysis, the maxima and minima (the respective plurals of maximum and minimum) of a function, known collectively as extrema (the plural of extremum), are the largest and smallest value of the function, either within a given range (the local or relative extrema), or on the entire domain (the global or absolute extrema).
narrower: Temporal maximum
created: 2022-02-07T17:00:00
in scheme: ozcar-theia
type: Concept