Air
broader: Atmosphere
in scheme: ozcar-theia
created: 2022-02-07T17:00:00
definition: [Wikipedia] The atmosphere of Earth, commonly known as air, is the layer of gases retained by Earth's gravity that surrounds the planet and forms its planetary atmosphere. The atmosphere of Earth protects life on Earth by creating pressure allowing for liquid water to exist on the Earth's surface, absorbing ultraviolet solar radiation, warming the surface through heat retention (greenhouse effect), and reducing temperature extremes between day and night (the diurnal temperature variation).
type: Concept
type: Entity

Atmosphere
type: Entity
type: Concept
narrower: Air