Coliform bacteria
type: Entity
type: Concept
narrower: Escherichia coli

Escherichia coli
alternative label: E. coli
broader: Coliform bacteria
definition: [Wikipedia] Escherichia coli also known as E. coli is a Gram-negative, facultative anaerobic, rod-shaped, coliform bacterium of the genus Escherichia that is commonly found in the lower intestine of warm-blooded organisms (endotherms).
created: 2022-02-07T17:00:00
in scheme: ozcar-theia
type: Entity
type: Concept