Oxyfluorfen
broader: Chemical entity
definition: [PubChem] Oxyfluorfen is an aromatic ether. It has a role as a herbicide and an EC 1.3.3.4 (protoporphyrinogen oxidase) inhibitor.
created: 2022-02-07T17:00:00
in scheme: ozcar-theia
type: Entity
type: Concept

Chemical entity
type: Concept
narrower: Oxyfluorfen