Conductivity
alternative label: Electrical conductivity
alternative label: Specific conductance
type: Concept
type: Property
modified: 2022-03-10T14:25:22
broader: Electronics and electromagnetism property
in scheme: ozcar-theia
created: 2022-02-07T17:00:00
definition: [Wikipedia] It represents a material's ability to conduct electric current. It is commonly signified by the Greek letter σ (sigma), but κ (kappa) (especially in electrical engineering) and γ (gamma) are sometimes used. The SI unit of electrical conductivity is siemens per metre (S/m).
definition: [GEMET] The ratio of the electric current density to the electric field in a material. Also known as electrical conductivity.
narrow match: http://vocabs.lter-europe.net/EnvThes/22289

Electronics and electromagnetism property
type: Concept
narrower: Conductivity