Chemical entity
type: Concept
narrower: Fluazifop-P-butyl

Fluazifop-P-butyl
broader: Chemical entity
definition: [ChEBI] A butyl 2-(4-{[5-(trifluoromethyl)pyridin-2-yl]oxy}phenoxy)propanoate that has R configutation. The active enantiomer of the herbicide fluazifop-butyl, it is used as a post-emergence herbicide for the control grass weeds in various broad-leaved crops.
created: 2022-02-07T17:00:00
in scheme: ozcar-theia
type: Entity
type: Concept