Chemical entity
type: Concept
narrower: Gallium

Gallium
alternative label: Ga
broader: Chemical entity
definition: [Wikipedia] Gallium is a chemical element with the symbol Ga and atomic number 31. Elemental gallium is a soft, silvery metal at standard temperature and pressure; however in its liquid state it becomes silvery white. If too much force is applied, the gallium may fracture conchoidally. It is in group 13 of the periodic table, and thus has similarities to the other metals of the group, aluminium, indium, and thallium. Gallium does not occur as a free element in nature, but as gallium (III) compounds in trace amounts in zinc ores such as sphalerite and in bauxite. Elemental gallium is a liquid at temperatures greater than 29.76 °C (85.57 °F), and will melt in a person's hands at normal human body temperature of 37.0 °C (98.6 °F).
created: 2022-02-07T17:00:00
in scheme: ozcar-theia
type: Entity
type: Concept