Phytosanitary substance, of chemical formula C9H11O2N2Br, for use as a herbicide of certain broadleaf weeds and usable on potato, artichoke, tobacco and lamb's lettuce crops.
source: métobromuron

Chemical entity
type: Concept
narrower: Metobromuron

Metobromuron
broader: Chemical entity
definition: Phytosanitary substance, of chemical formula C9H11O2N2Br, for use as a herbicide of certain broadleaf weeds and usable on potato, artichoke, tobacco and lamb's lettuce crops.
modified: 2023-05-12T14:28:10
in scheme: ozcar-theia
type: Entity
type: Concept