Snow cover
broader: Snow
definition: The total amount of snow that accumulates on the ground in a given location, including that from snowfall, snowdrift, and avalanche.
modified: 2023-05-12T15:13:43
created: 2023-01-24T11:02:05
in scheme: ozcar-theia
type: Entity
type: Concept

Snow
type: Entity
type: Concept
narrower: Snow cover