Dichlobenil
type: Concept
type: Entity
alternative label: DCBN
alternative label: 2,6-dichlorobenzonitrile
broader: Chemical entity
created: 2022-02-07T17:00:00
definition: [Wikipedia] 2,6-Dichlorobenzonitrile (DCBN or dichlobenil) is an organic compound with the chemical formula C6H3Cl2CN. It is a white solid that is soluble in organic solvents. It is widely used as an herbicide.
definition: [ChEBI] A nitrile that is benzonitrile which is substituted by chlorines at positions 2 and 6. A cellulose synthesis inhibitor, it is used as a pre-emergent and early post-emergent herbicide.
in scheme: ozcar-theia

Chemical entity
type: Concept
narrower: Dichlobenil