Vegetation stratification
type: Entity
type: Concept
narrower: Canopy

Canopy
broader: Vegetation stratification
definition: [Agrovoc] Cover of leaves and branches formed collectively by tops of plants; for vegetation covering the soil use
created: 2022-02-07T17:00:00
in scheme: ozcar-theia
type: Entity
type: Concept