Clumping index
alternative label: CI
broader: Vegetation property
definition: [https://doi.org/10.1016/j.agrformet.2021.108374] Clumping index (CI) characterizes the spatial distribution of leaves or needles within a vegetation. CI is critical in determining the vegetation radiation transfer, photosynthesis, and hydrological processes.
modified: 2022-03-10T14:11:56
created: 2022-02-07T17:00:00
in scheme: ozcar-theia
type: Property
type: Concept

Vegetation property
type: Concept
narrower: Clumping index