Tebuconazole
broader: Chemical entity
definition: A racemate composed of equimolar amounts of (R)- and (S)-tebuconazole. A fungicide effective against various smut and bunt diseases in cereals and other field crops.
in scheme: ozcar-theia
type: Entity
type: Concept

A racemate composed of equimolar amounts of (R)- and (S)-tebuconazole. A fungicide effective against various smut and bunt diseases in cereals and other field crops.
source: https://www.ebi.ac.uk/chebi/searchId.do

Chemical entity
type: Concept
narrower: Tebuconazole