Temporal rate
type: Concept
narrower: Speed

Speed
broader: Temporal rate
definition: [Wikipedia] In everyday use and in kinematics, the speed (commonly referred to as v) of an object is the magnitude of the rate of change of its position with time or the magnitude of the change of its position per unit of time; it is thus a scalar quantity.
modified: 2022-03-10T13:29:55
created: 2022-02-07T17:00:00
in scheme: ozcar-theia
type: Property
type: Concept