Simplified label
comment: For Theia OZCAR information system purpose. This label is used to enhance discoverability on the information system.

Atmospheric water vapor variable
type: CategoryOfVariable
type: Concept
narrower: Air specific humidity

Air
type: Entity
type: Concept

Air specific humidity
alternative label: Humidity mixing ratio
alternative label: Moisture content
broader: Atmospheric water vapor variable
has object of interest: Air
description: Scientific variable observing air specific humidity
type: Variable
type: Concept
created: 2022-02-07T17:00:00
Simplified label: Air specific humidity
in scheme: ozcar-theia
definition: [Wikipedia] Specific humidity (or moisture content) is the ratio of the mass of water vapor to the total mass of the air parcel. Specific humidity is approximately equal to the mixing ratio, which is defined as the ratio of the mass of water vapor in an air parcel to the mass of dry air for the same parcel.