Plant part
type: Entity
type: Concept
narrower: Leaf

Leaf
broader: Plant part
definition: [Wikipedia] A leaf (plural leaves) is the principal lateral appendage of the vascular plant stem, usually borne above ground and specialized for photosynthesis. The leaves, stem, flower and fruit together form the shoot system. Leaves are collectively referred to as foliage, as in "autumn foliage".
created: 2022-02-07T17:00:00
in scheme: ozcar-theia
type: Entity
type: Concept