Cryosphere feature
type: Collection
member: Glacier

Environmental feature
type: Collection
member: Entity

Entity
type: Collection
member: Cryosphere feature

Glacier
type: FeatureOfInterest
broader: Cryosphere
definition: [Wikipedia] A glacier is a persistent body of dense ice that is constantly moving under its own weight. A glacier forms where the accumulation of snow exceeds its ablation over many years, often centuries. Glaciers slowly deform and flow under stresses induced by their weight, creating crevasses, seracs, and other distinguishing features. They also abrade rock and debris from their substrate to create landforms such as cirques, moraines, or fjords.
created: 2022-02-07T17:00:00
in scheme: ozcar-theia
type: Entity
type: Concept

Cryosphere
type: Entity
type: Concept
narrower: Glacier

Feature of interest
type: Collection
member: Environmental feature