Chemical entity
type: Concept
narrower: Simazine

Simazine
broader: Chemical entity
definition: [Wikipedia] Simazine is a herbicide of the triazine class. The compound is used to control broad-leaved weeds and annual grasses.
definition: [ChEBI] A diamino-1,3,5-triazine that is N,N'-diethyl-1,3,5-triazine-2,4-diamine substituted by a chloro group at position 6.
created: 2022-02-07T17:00:00
in scheme: ozcar-theia
type: Entity
type: Concept