Water
type: Entity
type: Concept
narrower: Cloud

Cloud
broader: Water
broader: Atmosphere
definition: [Wikipedia] Visible mass of liquid droplets or frozen crystals suspended in the atmosphere
created: 2022-02-07T17:00:00
in scheme: ozcar-theia
type: Entity
type: Concept

Atmosphere
type: Entity
type: Concept
narrower: Cloud