Property
type: Concept
narrower: Mass balance

Mass balance
alternative label: Material balance
broader: Property
definition: [Wikipedia] A mass balance, also called a material balance, is an application of conservation of mass to the analysis of physical systems.
created: 2022-02-07T17:00:00
in scheme: ozcar-theia
type: Property
type: Concept