Sulfur
created: 2022-02-07T17:00:00
type: Entity
type: Concept
alternative label: S
in scheme: ozcar-theia
definition: [Wikipedia] Sulfur (in British English: sulphur) is a chemical element with the symbol S and atomic number 16. It is abundant, multivalent and nonmetallic. Under normal conditions, sulfur atoms form cyclic octatomic molecules with a chemical formula S8. Elemental sulfur is a bright yellow, crystalline solid at room temperature.
modified: 2022-09-20T10:04:04
broader: Chemical entity

Chemical entity
type: Concept
narrower: Sulfur