Water
type: Entity
type: Concept
narrower: Raindrop

Raindrop
type: Entity
broader: Water
definition: [Wikipedia] Raindrops are drops of atmospheric liquid water.
created: 2022-02-07T17:00:00
in scheme: ozcar-theia
type: Concept