A substituted aniline that is N,N-dipropylaniline substituted by a nitro groups at positions 2 and 6 and a trifluoromethyl group at position 4. It is an agrochemical used as a pre-emergence herbicide.
source: https://www.ebi.ac.uk/chebi/searchId.do

Chemical entity
type: Concept
narrower: Trifluralin

Trifluralin
broader: Chemical entity
definition: A substituted aniline that is N,N-dipropylaniline substituted by a nitro groups at positions 2 and 6 and a trifluoromethyl group at position 4. It is an agrochemical used as a pre-emergence herbicide.
in scheme: ozcar-theia
type: Entity
type: Concept