Temporal rate
type: Concept
narrower: Power

Power
broader: Temporal rate
definition: In physics, power is the amount of energy transferred or converted per unit time. In the International System of Units, the unit of power is the watt, equal to one joule per second.
modified: 2022-03-10T15:00:26
created: 2022-03-10T14:59:51
in scheme: ozcar-theia
type: Property
type: Concept

In physics, power is the amount of energy transferred or converted per unit time. In the International System of Units, the unit of power is the watt, equal to one joule per second.
source: Power (physics)