Cyanobacteria
alternative label: Cyanophyta
broader: Bacteria
definition: [Wikipedia] Cyanobacteria also known as Cyanophyta, are a phylum of Gram-negative bacteria that obtain energy via photosynthesis.
created: 2022-02-07T17:00:00
in scheme: ozcar-theia
type: Entity
type: Concept

Bacteria
type: Entity
type: Concept
narrower: Cyanobacteria