Physical entity
type: Concept
narrower: Man-made object

Man-made object
broader: Physical entity
definition: A man-made material thing that can be seen and touched.
created: 2022-02-07T17:00:00
in scheme: ozcar-theia
type: Entity
type: Concept