Major ions
type: Entity
type: Concept
narrower: Chloride

Chemical entity
type: Concept
narrower: Chloride

Chloride
type: Entity
modified: 2022-09-20T08:48:44
broader: Major ions
broader: Chemical entity
type: Concept
created: 2022-02-07T17:00:00
in scheme: ozcar-theia
definition: [ChEBI] A halide anion formed when chlorine picks up an electron to form an an anion.