Plant part
type: Entity
type: Concept
narrower: Foliage

Foliage
broader: Plant part
definition: [Cambridge dictionary] the leaves of a plant or tree, or leaves on the stems or branches on which they are growing.
created: 2022-02-07T17:00:00
in scheme: ozcar-theia
type: Entity
type: Concept