Bacteria
type: Entity
type: Concept
narrower: Coliform bacteria

Escherichia coli
type: Entity
type: Concept
broader: Coliform bacteria

Coliform bacteria
type: Entity
broader: Bacteria
definition: [Wikipedia] Coliform bacteria are defined as Rod shaped Gram-negative non-spore forming and motile or non-motile bacteria which can ferment lactose with the production of acid and gas when incubated at 35–37°C.
narrower: Escherichia coli
created: 2022-02-07T17:00:00
in scheme: ozcar-theia
type: Concept