Uranium-238 (238U or U-238) is the most common isotope of uranium found in nature, with a relative abundance of 99%.
source: Uranium-238

Chemical entity
type: Concept
narrower: Uranium-238

Uranium-238
broader: Chemical entity
definition: Uranium-238 (238U or U-238) is the most common isotope of uranium found in nature, with a relative abundance of 99%.
modified: 2023-09-15T12:32:11
created: 2023-09-15T12:29:27
in scheme: ozcar-theia
type: Entity
type: Concept