Tungsten
type: Entity
broader: Chemical entity
definition: Tungsten, or wolfram, is a chemical element with the symbol W and atomic number 74. Tungsten is a rare metal found naturally on Earth almost exclusively as compounds with other elements.
modified: 2023-05-12T14:44:13
created: 2022-02-07T17:00:00
in scheme: ozcar-theia
type: Concept

Chemical entity
type: Concept
narrower: Tungsten

Tungsten, or wolfram, is a chemical element with the symbol W and atomic number 74. Tungsten is a rare metal found naturally on Earth almost exclusively as compounds with other elements.
source: Tungsten