Radiative transfert property
type: Concept
narrower: Absorbance

Absorbance
modified: 2022-03-10T13:13:52
broader: Radiative transfert property
created: 2022-02-07T17:00:00
type: Property
type: Concept
definition: [DBpedia] In chemistry, absorbance or decadic absorbance is the common logarithm of the ratio of incident to transmitted radiant power through a material, and spectral absorbance or spectral decadic absorbance is the common logarithm of the ratio of incident to transmitted spectral radiant power through a material.
definition: [NAL] A measure of the amount of light absorbed by a surface.
in scheme: ozcar-theia