Glycine
type: Concept
definition: [ChEBI] The simplest (and the only achiral) proteinogenic amino acid, with a hydrogen atom as its side chain.
definition: [Wikipedia] Glycine (symbol Gly or G; ) is an amino acid that has a single hydrogen atom as its side chain. It is the simplest stable amino acid (carbamic acid is unstable), with the chemical formula NH2‐CH2‐COOH. Glycine is one of the proteinogenic amino acids. It is encoded by all the codons starting with GG (GGU, GGC, GGA, GGG). Glycine is integral to the formation of alpha-helices in secondary protein structure due to its compact form. For the same reason, it is the most abundant amino acid in collagen triple-helices. Glycine is also an inhibitory neurotransmitter – interference with its release within the spinal cord (such as during a Clostridium tetani infection) can cause spastic paralysis due to uninhibited muscle contraction. Glycine is a colorless, sweet-tasting crystalline solid. It is the only achiral proteinogenic amino acid. It can fit into hydrophilic or hydrophobic environments, due to its minimal side chain of only one hydrogen atom. The acyl radical is glycyl.
alternative label: Amino acid G
broad match: http://vocabs.lter-europe.net/EnvThes/20775
broad match: http://www.eionet.europa.eu/gemet/concept/373
type: Entity
broader: Chemical entity
related: Glycine tracer dilution
created: 2022-02-07T17:00:00
in scheme: ozcar-theia

Chemical entity
type: Concept
narrower: Glycine

Glycine tracer dilution
type: Entity
type: Concept
related: Glycine