A racemate comprising equimolar amounts of (R)- and (S)-fenpropimorph. It is a systemic fungicide, used to control a variety of fungal diseases in cereal crops.
source: https://www.ebi.ac.uk/chebi/searchId.do

Chemical entity
type: Concept
narrower: Fenpropimorph

Fenpropimorph
broader: Chemical entity
definition: A racemate comprising equimolar amounts of (R)- and (S)-fenpropimorph. It is a systemic fungicide, used to control a variety of fungal diseases in cereal crops.
in scheme: ozcar-theia
type: Entity
type: Concept