Man-made structure
type: Concept
narrower: Dam

Dam
broader: Man-made structure
definition: [Wikipedia] A dam is a barrier that stops or restricts the flow of surface water or underground streams. Reservoirs created by dams not only suppress floods but also provide water for activities such as irrigation, human consumption, industrial use, aquaculture, and navigability.
created: 2022-02-07T17:00:00
in scheme: ozcar-theia
type: Entity
type: Concept