Chemical entity
type: Concept
narrower: Titanium

Titanium
type: Entity
type: Concept
created: 2022-02-07T17:00:00
alternative label: Ti
broader: Chemical entity
definition: [Wikipedia] Titanium is a chemical element with the symbol Ti and atomic number 22. Its atomic weight is 47.867 measured in daltons. It is a lustrous transition metal with a silver color, low density, and high strength. Titanium is resistant to corrosion in sea water, aqua regia, and chlorine.
in scheme: ozcar-theia