Chemical entity
type: Concept
narrower: Prometryn

Prometryn
type: Entity
type: Concept
created: 2022-02-07T17:00:00
broader: Chemical entity
definition: [ChEBI] A diamino-1,3,5-triazine that is N,N'-di(propan-2-yl)-1,3,5-triazine-2,4-diamine substituted by a methylsulfanediyl group at position 6.
in scheme: ozcar-theia