Groundwater
type: Entity
type: Concept
narrower: Water table

Water table
type: Concept
type: Entity
created: 2022-02-07T17:00:00
broader: Groundwater
definition: [Wikipedia] The water table is the upper surface of the zone of saturation. The zone of saturation is where the pores and fractures of the ground are saturated with water. It can also be simply explained as, the upper level, below which the ground is saturated.
definition: [EnvThes] upper surface of the zone of saturation, below which all available pores in soil and rock are ﬁlled with water.
in scheme: ozcar-theia