Electronics and electromagnetism property
type: Concept
narrower: Magnetic susceptibility

Magnetic susceptibility
type: Property
type: Concept
created: 2022-02-07T17:00:00
modified: 2022-03-10T14:26:37
broader: Electronics and electromagnetism property
definition: [Wikipedia] The magnetic susceptibility (denoted χ) is a measure of how much a material will become magnetized in an applied magnetic field. It is the ratio of magnetization M (magnetic moment per unit volume) to the applied magnetizing field intensity H.
in scheme: ozcar-theia