Chemical entity
type: Concept
narrower: Cycloxydim

Cycloxydim
type: Entity
type: Concept
created: 2022-02-07T17:00:00
broader: Chemical entity
definition: [ChEBI] A β-diketone that is cyclohexa-1,3-dione which is substituted at position 2 by an N-ethoxybutanimidoyl group and at position 5 by a tetrahydro-2H-thiopyran-3-yl group. A systemic herbicide effective against grasses, it is used in the cultivation of a variety of crops, including oil seed rape and potatoes.
in scheme: ozcar-theia