Property
type: Concept
narrower: Thermal conductivity

Thermal conductivity
type: Property
type: Concept
created: 2022-02-07T17:00:00
broader: Property
definition: [Wikipedia] The thermal conductivity of a material is a measure of its ability to conduct heat.
in scheme: ozcar-theia