Plant phenological state change
type: Entity
type: Concept
narrower: Fruiting

Fruiting
type: Entity
type: Concept
created: 2022-02-07T17:00:00
modified: 2023-05-12T14:51:05
broader: Plant phenological state change
definition: Fruit set is the initial phase of fruit formation. It is the moment when the ovary of the flower turns into fruit after fertilization.
in scheme: ozcar-theia

Fruit set is the initial phase of fruit formation. It is the moment when the ovary of the flower turns into fruit after fertilization.
source: Nouaison