Land surface
type: Entity
type: Concept
narrower: Soil

Permafrost
type: Entity
type: Concept
broader: Soil

Soil
type: Concept
type: Entity
created: 2022-02-07T17:00:00
broader: Land surface
definition: [GEMET] The top layer of the land surface of the earth that is composed of disintegrated rock particles, humus, water and air.
in scheme: ozcar-theia
narrower: Permafrost