Physical entity
type: Concept
narrower: Structure

Man-made structure
type: Concept
broader: Structure

Structure
type: Concept
created: 2022-02-07T17:00:00
broader: Physical entity
definition: [Wikipedia] A structure is an arrangement and organization of interrelated elements in a material object or system, or the object or system so organized. Material structures include man-made objects such as buildings and machines and natural objects such as biological organisms, minerals and chemicals. Abstract structures include data structures in computer science and musical form. Types of structure include a hierarchy (a cascade of one-to-many relationships), a network featuring many-to-many links, or a lattice featuring connections between components that are neighbors in space.
in scheme: ozcar-theia
narrower: Man-made structure