Electromagnetic radiation
type: Entity
type: Concept

Global radiation
type: Constraint
type: Concept
created: 2022-02-07T17:00:00
broader: Radiation transfer constraint
definition: [openmod] Global radiation is the total short-wave radiation from the sky falling onto a horizontal surface on the ground. It includes both the direct solar radiation and the diffuse radiation resulting from reflected or scattered sunlight.
in scheme: ozcar-theia
related match: http://vocabs.lter-europe.net/EnvThes/22125
constrains: Electromagnetic radiation

Radiation transfer constraint
type: Concept
narrower: Global radiation