Lutetium
type: Entity
type: Concept
created: 2022-02-07T17:00:00
alternative label: Lu
broader: Chemical entity
definition: [Wikipedia] Lutetium is a chemical element with the symbol Lu and atomic number 71. It is a silvery white metal, which resists corrosion in dry air, but not in moist air. Lutetium is the last element in the lanthanide series, and it is traditionally counted among the rare earths. Lutetium is generally considered the first element of the 6th-period transition metals by those who study the matter, although there has been some dispute on this point.
in scheme: ozcar-theia

Chemical entity
type: Concept
narrower: Lutetium