Deuterium
type: Entity
type: Concept
created: 2022-02-07T17:00:00
modified: 2022-09-20T08:49:35
broader: Chemical entity
definition: [ChEBI] The stable isotope of hydrogen with relative atomic mass 2.014102 and a natural abundance of 0.0115 atom percent (from Greek δευτερον, second).
in scheme: ozcar-theia

Chemical entity
type: Concept
narrower: Deuterium