Phenomenon
type: Concept
narrower: Radiation

Electromagnetic radiation
type: Entity
type: Concept
broader: Radiation

Radiation
type: Entity
type: Concept
created: 2022-02-07T17:00:00
broader: Phenomenon
definition: [Gemet] Emission of any rays from either natural or man-made origins, such as radio waves, the sun's rays, medical X-rays and the fall-out and nuclear wastes produced by nuclear weapons and nuclear energy production. Radiation is usually divided between non-ionizing radiation, such as thermal radiation (heat) and light, and nuclear radiation. Non-ionizing radiation includes ultraviolet radiation from the sun which, although it can damage cells and tissues, does not involve the ionization events of nuclear radiation.
definition: [Wikipedia] In physics, radiation is the emission or transmission of energy in the form of waves or particles through space or through a material medium. This includes: - electromagnetic radiation, such as radio waves, microwaves, infrared, visible light, ultraviolet, x-rays, and gamma radiation (γ) - particle radiation, such as alpha radiation (α), beta radiation (β), proton radiation and neutron radiation (particles of non-zero rest energy) - acoustic radiation, such as ultrasound, sound, and seismic waves (dependent on a physical transmission medium) - gravitational radiation, radiation that takes the form of gravitational waves, or ripples in the curvature of spacetime
in scheme: ozcar-theia
narrow match: http://vocabs.lter-europe.net/EnvThes/21175
narrow match: http://vocabs.lter-europe.net/EnvThes/21157
narrower: Electromagnetic radiation