Carbonate
type: Concept
type: Entity
created: 2022-02-07T17:00:00
broader: Chemical entity
definition: [Wikipedia] In chemistry, a carbonate is a salt of carbonic acid (H2CO3), characterized by the presence of the carbonate ion, a polyatomic ion with the formula of CO2− 3. The name may also refer to a carbonate ester, an organic compound containing the carbonate group C(=O)(O–)2.
definition: [ChEBI] Organooxygen compounds that are salts or esters of carbonic acid, H2CO3.
in scheme: ozcar-theia
narrow match: http://vocabs.lter-europe.net/EnvThes/20806

Chemical entity
type: Concept
narrower: Carbonate